Ontología BNE
type: Ontology
contributor: Daniel Vila-Suero Roberto Gómez Prada Ricardo Santos Munoz Memorandum Multimedia
creator: Biblioteca Nacional de España
abstract: La ontología de la Biblioteca Nacional de España (BNE) es el modelo de datos central que se utiliza en datos.bne.es, la base de conocimiento abierta de la BNE. datos.bne.es recoge, integra y estructura información del catálogo y las digitalizaciones producidas en los sistemas de información de la BNE poniendola disponible utilizando tecnologías semánticas y datos enlazados. La ontología se complementa con la reutilización de otras propiedades de otras ontologías (RDA, DC) que no se hacen explícitas en este documento.
abstract: The ontology of National Library of Spain (BNE) is the core data model undelying the Linked Data solution of BNE: datos.bne.es. datos.bne.es is an open knowledge base that gathers, integrates and delivers the full catalogue in open and semantically enriched formats. The ontology is complemented with the use of other relevant properties from selected ontologies (RDA, DC), not explicit in this document. The ontology is based on the basic underlying entities from IFLA's Library Reference Model ((Work, Expression, Manifestation, Item, Agent) [https://www.ifla.org/wp-content/uploads/2019/05/assets/cataloguing/frbr-lrm/ifla-lrm-august-2017_rev201712.pdf], refined, adapted or broadened to the needs and structure of BNE data. All the data comes from the BNE catalog records. After an analysis and tranformation phase, data are distributed among the ontology classes and interrelationship between them are built. The web https://datos.bne.es is, therefore, just a possible visualization tool made on top the data. However, the whole dataset can be queried through the Sparql endpoint (datos.bne.es/sparql) or be downloaded from datos.gob.es at https://datos.gob.es/es/catalogo/ea0019768-catalogo-de-datos-enlazados-de-la-biblioteca-nacional-de-espana @en
created: 2014-3-11
license: http://creativecommons.org/licenses/by-nc-sa/2.0/
modified: 2022-01-20
title: BNE ontology @en
example: http://datos.bne.es/resource/XX1147441
preferred namespace prefix: bneonto
comment: La ontología de la Biblioteca Nacional de España (BNE) es el modelo de datos central que se utiliza en datos.bne.es, la base de conocimiento abierta de la BNE. datos.bne.es recoge, integra y estructura información del catálogo y las digitalizaciones producidas en los sistemas de información de la BNE poniendola disponible utilizando tecnologías semánticas y datos enlazados. La ontología se complementa con la reutilización de otras propiedades de otras ontologías (RDA, DC) que no se hacen explícitas en este documento. La ontología se basa en las entidades básicas del modelo de datos de referencia de IFLA Library Reference Model (Work, Expression, Manifestation, Item, Agent) [https://www.ifla.org/wp-content/uploads/2019/05/assets/cataloguing/frbr-lrm/ifla-lrm-august-2017_rev201712.pdf], refinadas, adaptadas o ampliadas a las necesidades y a los datos de BNE. La fuente de los datos es el conjunto de los registros del catálogo de BNE, que, tras una fase de análisis y transformación, distribuye los datos entre las clases de la ontología y construye las relaciones entre ellas. La web https://datos.bne.es es sólo una posible visualización. No obstante, el conjunto de datos puede accederse a través de un punto de consulta Sparql (datos.bne.es/sparql) o acceder a descargas masivas de datos, en datos.gob (https://datos.gob.es/es/catalogo/ea0019768-catalogo-de-datos-enlazados-de-la-biblioteca-nacional-de-espana)
version info: 2.0

es creada por (persona)
type: ObjectProperty
sub property of: P10437
inverse of: es creador de (persona)
domain: Obra
range: Persona
label: Autor
comment: Relaciona una obra con una persona que se considera autora de su contenido intelectual o artístico
comment: Relates a work to a person who is responsible for a work. [source: http://rdaregistry.info/Elements/w/P10437] @en
label: is created by (person) @en

es realizada a través de
type: ObjectProperty
sub property of: P2001
sub property of: P10078
inverse of: es realización de
domain: Obra
range: Expresión
label: Versión
comment: Relaciona una obra con una expresión que la realiza @en
comment: Relates a work to an expression that is the realization of the work. [source: http://iflastandards.info/ns/fr/frbr/frbrer/P2001] @en
label: is realized through @en

tiene parte (obra)
type: ObjectProperty
sub property of: P2057
sub property of: P10147
inverse of: forma parte de (obra)
domain: Obra
range: Obra
comment: Relaciona una obra con obra que es parte componente de ella
comment: Relates a work to another work that is a component of the work. [source: http://iflastandards.info/ns/fr/frbr/frbrer/P2057 ] @en
label: has part (work) @en

forma parte de (obra)
type: ObjectProperty
sub property of: P2058
sub property of: P10019
domain: Obra
range: Obra
comment: Relaciona una obra con otra obra de la que es parte
comment: Relates a work to another work of which it is a component [source: http://iflastandards.info/ns/fr/frbr/frbrer/P2058] @en
label: is part of work (work) @en

es creada por (entidad corporativa)
type: ObjectProperty
sub property of: P10531
inverse of: es creador de (entidad corporativa)
domain: Obra
range: Entidad Corporativa
comment: Relaciona una obra con una entidad corporativa que se considera autora de su contenido intelectual o artístico
comment: Relates a work to a corporate body who is responsible for a work. [source: http://rdaregistry.info/Elements/w/P10531] @en
label: is created by (corporate body) @en

tiene como materia (obra)
type: ObjectProperty
sub property of: P10257
inverse of: es materia de (obra)
domain: Obra
range: Obra
comment: Relaciona una obra con una obra, que es tema de la primera
comment: Relates a work to a work that a work is about. @en
label: has as subject (work) @en

es materia de (obra)
type: ObjectProperty
sub property of: P10264
domain: Obra
range: Obra
comment: Relaciona una Obra con una obra que trata sobre ella
comment: Relates a Work to a work that is about the work @en
label: is subject (work) of @en

tiene como materia (persona)
type: ObjectProperty
sub property of: P10261
inverse of: es materia (persona) de
domain: Obra
range: Persona
comment: Relaciona una obra con una persona, que es tema de dicha obra
comment: Relates a work to a person that a work is about. @en
label: has subject (person) @en

tiene como materia (expresión)
type: ObjectProperty
sub property of: P10258
inverse of: es materia (expresión) de
domain: Obra
range: Expresión
comment: Relaciona una obra con una expresión, que es tema de dicha obra
comment: Relates a work to a expression that a work is about. @en
label: has as subject (expression) @en

tiene como materia (entidad corporativa)
type: ObjectProperty
sub property of: P10263
inverse of: es materia (entidad corporativa) de
domain: Obra
range: Entidad Corporativa
comment: Relaciona una obra con una entidad corporativa, que es tema de dicha obra
comment: Relates a work to a corporate body that a work is about. @en
label: has as subject (corporate body) @en

está materializada en
type: ObjectProperty
sub property of: P60313
inverse of: es materialización de
domain: Expresión
range: Recurso
comment: Relaciona una expresión con un recurso, esto es, una materialización física de la expresión
comment: Relates an expression to a resource, id est, a physical embodiment of an expression. @en
label: is embodied in @en

es realización de
type: ObjectProperty
sub property of: P2002
sub property of: P20231
domain: Expresión
range: Obra
comment: Relaciona una expresión con una obra que se realiza a través de ella
comment: Relates an expression to the work that is realized through the expression [source: FRBRer: http://iflastandards.info/ns/fr/frbr/frbrer/P2002] @en
label: is realization of @en

tiene parte (expresión)
type: ObjectProperty
sub property of: P2079
sub property of: P20145
inverse of: forma parte (expresión) de
domain: Expresión
range: Expresión
comment: Relaciona una expresión con otra que es parte de ella
comment: Relates an expression to another expression that is a component of the expression. [source: http://iflastandards.info/ns/fr/frbr/frbrer/P2079] @en
label: has part (expression) @en

forma parte (expresión) de
type: ObjectProperty
sub property of: P2080
sub property of: P20074
domain: Expresión
range: Expresión
comment: Relaciona una expresión con otra expresión de la que es parte
comment: Relates an expression to another expression of which it is a component. [source: http://iflastandards.info/ns/fr/frbr/frbrer/P2080] @en
label: is part (expression) of @en

es materia (expresión) de
type: ObjectProperty
sub property of: P20268
domain: Expresión
range: Obra
comment: Relaciona una Expresión con una obra que trata sobre ella
comment: Relates an expression to a work that is about the expression @en
label: is subject (expression) of @en

está ejemplificado por
type: ObjectProperty
inverse of: es ejemplar de
domain: Recurso
range: Ejemplar
comment: Relaciona un recurso con un ejemplar concreto que lo contiene
comment: Relates a resource to an item that is a single instance of the resource. @en
label: is exemplified by @en

es materialización de
type: ObjectProperty
sub property of: P60313
domain: Recurso
range: Expresión
comment: Relaciona un recurso con la expresión que está contenida en el recurso
comment: Relates a resource to an expression that is embodied by the resource @en
label: is embodiment of @en

es creado (recurso) por (persona)
type: ObjectProperty
sub property of: P60447
inverse of: es creador (persona) de (recurso)
domain: Recurso
range: Persona
comment: Relaciona directamente un recurso con una persona que se considera el creador de su contenido intelectual o artístico, cuando no se ha podido inferir la obra que contiene
comment: Relates directly a resource to a corporate body which is considered the creator of its intelectual or artistic content, when no work could be inferrer or ascertained @en
label: is created (resource) by (person) @en

es creado (recurso) por (entidad corporativa)
type: ObjectProperty
sub property of: P60447
inverse of: es creador (entidad corporativa) de (recurso)
domain: Recurso
range: Entidad Corporativa
comment: Relaciona directamente un recurso con una entidad corporativa que se considera el creador de su contenido intelectual o artístico, cuando no se ha podido inferir la obra que contiene
comment: Relates directly a resource to a corporate body which is considered the creator of its intelectual or artistic content, when no work could be inferrer or ascertained @en
label: is created (resource) by (corporate body) @en

contribuye (persona) a (recurso)
type: ObjectProperty
inverse of: tiene contribuidor
domain: Persona
range: Recurso
comment: Relaciona una persona con un recurso con la que tiene un grado de responsabilidad no determinado (traductor, ilustrador, editor literario, coautor)
comment: Relates a person with a resource that involves an uncertain degree of responsability (translator, illustrator, editor, co-author) @en
label: contributes (person) to (recurso) @en

tiene contribuidor
type: ObjectProperty
sub property of: contributor
domain: Recurso
range: Persona
range: Entidad Corporativa
label: Participante
label: has contributor @en

tiene relación
type: ObjectProperty
sub property of: P60313
domain: Recurso
comment: Relaciona un recurso con una obra o expresión con la que guarda una relación de contenido o derivativa
comment: Relates a resource with a work or expression related. This can be a content or derivative relationship @en
label: has relation @en

tiene como materia
type: ObjectProperty
sub property of: P60805
domain: Recurso
label: Tema
comment: Relaciona un recurso con el tema que tiene como objeto. Este tema puede corresponder a cualquiera de las clases de la ontología
comment: Relates a resource with the subject it is about. The range of this relación can be any of the classes @en
label: has subject @en

Continuado por
type: ObjectProperty
sub property of: P60306
inverse of: Es continuación de
domain: Recurso
range: Recurso
comment: Relaciona un recurso (generalmente una publicación periódica), con otro que lo continúa en el tiempo
comment: Relates a resource (usually a serial) with other that precedes it chronologically @en
comment: Relates a resource (usually a serial) with other that succeeds it chronologically @en
label: Succedding resource @en

Es continuación de
type: ObjectProperty
sub property of: P60576
domain: Recurso
range: Recurso
comment: Relaciona un recurso (generalmente una publicación periódica) con otro que le antecede en el tiempo
label: Preceding resource @en

Publicado con
type: ObjectProperty
sub property of: P60256
domain: Recurso
range: Recurso
comment: Relaciona un recurso con otro con el que se publica conjuntamente
comment: Relates a resource to a resource that is issued on the same carrier as a manifestation being described. @en
label: Issued with @en

es ejemplar de
type: ObjectProperty
sub property of: P40095
domain: Ejemplar
range: Recurso
comment: "Relates an item to a resource that is exemplified by an item." @en
comment: Relaciona un ejemplar con un recurso del cual es un ejemplar
label: is exemplar of @en

es creador de (persona)
type: ObjectProperty
sub property of: P50542
domain: Persona
range: Obra
comment: Relaciona una persona con una obra con la que tiene la principal responsabilidad en la creación de su contenido
comment: Relates a person to a work that involves a responsibility of a person for creation [source: http://www.rdaregistry.info/Elements/a/#P50542] @en
label: is creator of (person) @en

es creador (persona) de (recurso)
type: ObjectProperty
sub property of: P60672
domain: Persona
range: Recurso
comment: Relaciona una persona directamente con un recurso de la cual se le considera autora, cuando la obra no ha podido ser inferida
comment: Relates directly a person to a resource that involves a creation responsibility, when the work could not be inferred or ascertained @en
label: is creator (person) of (resource) @en

es materia (persona) de
type: ObjectProperty
sub property of: P50249
domain: Persona
range: Obra
comment: Relaciona una Persona con una obra que trata sobre ella
comment: Relates a Person to a work that is about the person @en
label: is subject (person) of @en

tiene (Persona) Marca de propiedad
type: ObjectProperty
inverse of: es marca de propiedad de (Persona)
domain: Persona
range: Marca de propiedad
comment: Relaciona una Persona con una Marca de propiedad, de la cual se ha identificado como poseedor o poseedora
comment: Relate an instance of Person to an instance of Provenance mark, which he/she is the identified owner @en
label: has (Person) Provenance mark @en

Relaciona una Persona con otra relacionada, generalmente a través de una relación seudónimo con otros seudónimos y/o nombre real, y las inversas
type: ObjectProperty
sub property of: P50316
domain: Persona
range: Persona
comment: Persona relacionada @de
label: Related person @en
label: Relates a Person with another Person, usually through of a pseudonym - real name, and the reciprocal, relationship @en

Grupo relacionado con Persona
type: ObjectProperty
sub property of: P50318
domain: Persona
range: Entidad Corporativa
label: Group or Corporate Body related with Person @en

es creador de (entidad corporativa)
type: ObjectProperty
sub property of: P50844
domain: Entidad Corporativa
range: Obra
comment: Relaciona una entidad corporativa con una obra con la que tiene la principal responsabilidad en la creación de su contenido
comment: Relates a corporate body to a work that involves a responsibility of a corporate body for creation. [source: http://rdaregistry.info/Elements/a/P50844] @en
label: is creator (corporate body) of @en

es subordinado de
type: ObjectProperty
sub property of: P4014
sub property of: P50008
inverse of: tiene subordinado
domain: Entidad Corporativa
range: Entidad Corporativa
comment: Relaciona una Entidad Corporativa con otra Entidad Corporativa que es su subordinada jerárquicamente
comment: Relates a corporate body to another corporate body which is subordinate to the prior corporate body. [source: http://iflastandards.info/ns/fr/frad/P4014] @en
label: is subordinate of @en

tiene subordinado
type: ObjectProperty
sub property of: P4014
sub property of: P50010
domain: Entidad Corporativa
range: Entidad Corporativa
comment: Relaciona una entidad corporativa con otra que es su subordinada jerárquica
comment: Relates a corporate body to another corporate body which is subordinate to the prior corporate body. [source: http://iflastandards.info/ns/fr/frad/P4014] @en
label: has subordinate @en

es creador (entidad corporativa) de (recurso)
type: ObjectProperty
sub property of: P60672
domain: Entidad Corporativa
range: Recurso
comment: Relaciona una entidad corporativa directamente con un recurso de la cual se le considera autora, cuando la obra no ha podido ser inferida
comment: Relates directly a corporate body to a resource that involves a creation responsibility, when the work could not be inferred or ascertained @en
label: is creator (corporate body) of (resource) @en

es materia (entidad corporativa) de
type: ObjectProperty
sub property of: P50251
domain: Entidad Corporativa
range: Obra
comment: Relaciona una Entidad Corporativa con una obra que trata sobre ella
comment: Relates a corporate body to a work that is about a corporate body. @en
label: is subject (corporate body) of @en

tiene (entidad corporativa) Marca de propiedad
type: ObjectProperty
inverse of: es marca de propiedad de (Entidad corporativa)
domain: Entidad Corporativa
range: Marca de propiedad
comment: Relaciona una Entidad corporativa con una Marca de propiedad, de la cual se ha identificado como poseedor
comment: Relates an instance of Corporate body to an instance of Provenance mark, which it is identified as its owner @en
label: has (Corporate body) a Provenance mark @en

Grupo o entidad relacionada
type: ObjectProperty
sub property of: P50336
domain: Entidad Corporativa
range: Entidad Corporativa
comment: Relaciona un Grupo o Entidad relacionada con otro, que habitualmente le antecede o sucede en el tiempo
label: Related Group or Corporate Body @en
label: Relates a Group or Corporate Body with other, which usually preceeds or succeeds it @en

Persona relacionada con Grupo o Entidad
type: ObjectProperty
inverse of: Grupo relacionado con Persona
domain: Entidad Corporativa
range: Persona
comment: Relaciona un Grupo o Entidad con una persona, generalmente por causa de pertenencia
comment: Relates a Corporate Body or Group with a Person, usually because of membership @en
label: Person Related with Corporate Body or Group @en

tiene como materia (concepto)
type: ObjectProperty
sub property of: P10256
domain: Obra
comment: Relaciona una obra con un objeto que tiene como tema
comment: Relates a work to a concept that a work is about. @en
label: has as subject (concept) @en

es marca de propiedad de (Persona)
type: ObjectProperty
domain: Marca de propiedad
range: Persona
comment: Relaciona una instancia de Marca de propiedad con una instancia de Persona identificada como su poseedor
comment: Relates an instance of Provenance mark with the instance of Persons identified as its owner @en
label: is Provenance mark of (Person) @en

es marca de propiedad de (Entidad corporativa)
type: ObjectProperty
domain: Marca de propiedad
range: Entidad Corporativa
comment: Relaciona una instancia de Marca de propiedad con una instancia de Entidad Corporativa identificada como su poseedora
comment: Relates an instance of Provenance mark with the instance of Corporate body identified as its owner @en
label: is Provenance mark of (Corporate body) @en

Disponible en otro formato
type: ObjectProperty
sub property of: P60195
domain: Recurso
range: Recurso
type: DatatypeProperty
label: Otro soporte
comment: Relaciona un recurso con otro equivalente disponible en un formato diferente
comment: Relates a resource to a resource that carries the same content of a resource in a different format. [source:RDA] @en
label: Resource in an Additional Physical Form @en

Publicación principal
type: ObjectProperty
sub property of: P60259
sub property of: P60281
inverse of: Suplemento:
domain: Recurso
range: Recurso
type: DatatypeProperty
label: Publicación principal
comment: Relaciona un recurso con otro del cual es un suplemento
comment: Relates a resource to a parent resource of which is a supplement @en
label: Parent resource @en

Incluido en
type: ObjectProperty
sub property of: P60101
domain: Recurso
range: Recurso
type: DatatypeProperty
label: Incluido en
comment: A larger resource of which the described resource is a discrete component @en
comment: Recurso mayor del que recurso descrito es una parte
label: Included in @en

Suplemento:
type: ObjectProperty
sub property of: P60281
sub property of: P60259
domain: Recurso
range: Recurso
type: DatatypeProperty
label: Suplemento:
comment: Relaciona un recurso con otro que es su suplemento
comment: Relates a resource with other that is a supplement @en
label: Supplement: @en

Recurso relacionado
type: ObjectProperty
comment: Relaciona un recurso con otro relacionado con una relación distinta de las expresadas en la ontología
comment: Relates a resorce with other resouce, for a reason other than the expressed elsewhere in the ontology @en
label: Related resource @en

tiene título de la obra
type: DatatypeProperty
sub property of: P10088
domain: Obra
label: Title @en
label: Título
comment: Name by which the Work is mostly known, in its original languague (except classical Greeks Works and anonymous Works in non-latin script, that are preferred in Spanish) @en
comment: Nombre por el que es más conocido la obra, en su lengua original (con la excepción de obras clásicas griegas y clásicos anónimos en alfabeto no latino, que se escoge la forma en español)
label: has title of the work @en

fuente consultada
type: DatatypeProperty
label: Fuente consultada
label: Source consulted @en
comment: Fuente consultada para establecer la forma preferida de una Persona, Entidad Corporativa y Obra o de donde se ha extraído información relevante sobre ellos. Puede ser una cita del título de un recurso, una obra de referencia, un artículo, una página web, una llamada telefónica, un email de un investigador...
comment: Source of information consulted either to establish the preferred form of a Person, Corporate body or Work, or to extract relevant data about them. This source can be any book or resource, a reference work, a website, an email, a telephone call... @en
label: source consulted @en

información encontrada
type: DatatypeProperty
label: Información encontrada
label: Information found @en
comment: Información encontrada en una fuente especificada en la propiedad P1002 sobre una Persona, una Entidad Corporativa u Obra
comment: Information found in a Source referred in the Property P1002, related to a Person, a Corporate Body or a Work @en
label: citation note @en

tiene fecha de la obra
type: DatatypeProperty
sub property of: P10219
domain: Obra
label: Date @en
label: Fecha @fecha
label: has date of the work @en

tiene otra variante de nombre (obra)
type: DatatypeProperty
sub property of: P10086
domain: Obra
label: Otro título
label: Variant title @en
comment: Another name by which the Work is also knonw, othan the established as the preferred (Property P1001) @en
comment: Otro nombre por el que es conocida la Obra distinto del preferido (Propiedad P1001)
label: has other variant name (work) @en

numeración de parte
type: DatatypeProperty
sub property of: P10012
domain: Obra
label: Number @en
label: Número
comment: Designación asignada a una obra que identifica su posición en una secuenca de partes invididuales de una obra mayor [fuente: adaptada de RDA]
comment: Designation that is assigned to a work to identify its position in a sequence of individual parts of a larger work [source: adapted from RDA registry] @en
label: numbering of part @en

nota del catalogador
type: DatatypeProperty
domain: Obra
label: Cataloger's note @en
label: Nota del catalogador
label: cataloguer's note @en

tiene medio de interpretación (obra musical)
type: DatatypeProperty
sub property of: P60537
domain: Obra
label: Medio de interpretación
label: Medium of performance @en
label: has medium of performance (musical work) @en

tiene clave (obra musical)
type: DatatypeProperty
sub property of: P60580
domain: Obra
label: Key @en
label: Tonalidad
label: has key (musical work) @en

firmante del tratado
type: DatatypeProperty
sub property of: P60834
domain: Obra
label: Firmante del tratado
label: Signatory to the treaty @en
label: Signatory to a treaty, etc. @en

etiqueta asociada al autor
type: DatatypeProperty
sub property of: P61027
domain: Obra
domain: Recurso
comment: Cadena de texto con el nombre del autor de una obra o recurso. Utilizado para mejorar las búsquedas en el interfaz web @en
comment: Text string identifying an author of a work or a resource. Used to enhance web interface search capabilities @en
label: label associated with author @en

Name of part (work)
type: DatatypeProperty
comment: Name of a part of a Work @en
comment: Nombre de parte (Obra)
comment: Nombre de una parte de una Obra

Fuente consultada e información encontrada
type: DatatypeProperty
comment: Cita de la fuente consultada e información encontrada utilizada para establecer la forma preferida de una Persona, Entidad u Obra
comment: Source of information and data found, useful to establish a preferred name for a Person, Corporate Body or Work @en
label: Source of Information and Data Found @en

tiene lengua de la expresión
type: DatatypeProperty
sub property of: E3A6
sub property of: P20006
domain: Expresión
label: Language @en
label: Lengua
comment: Language used to express a textual Work. Includes the original language @en
comment: Lengua en la que obra textual se expresa. Incluye también la lengua original.
label: has language of expression @en

Otras características distintivas de expresión
type: DatatypeProperty
domain: Expresión
label: Form @en
label: Forma
label: Other distinguishing characteristic of expression @en

tiene nombre de editor, productor, distribuidor
type: DatatypeProperty
sub property of: P1017
sub property of: P60444
domain: Recurso
comment: Relaciona un recurso con el nombre de la persona o entidad corporativa que aparece en el recurso que lleva a cabo, respectivamente, la publicación, producción y/o distribución o las actividades de difusión del recurso. [Fuente: http://metadataregistry.org/schemapropel/list/schema_property_id/1958.html]
comment: Relates a resource to the name of the person or corporate body appearing on the resource that effects respectively the publication, production and/or distribution or release activities for the resource. [Source: http://metadataregistry.org/schemapropel/list/schema_property_id/1958.html] @en
label: has name of publisher, producer, distributor @en

tiene título propiamente dicho
type: DatatypeProperty
sub property of: P1004
sub property of: P60515
domain: Recurso
comment: Relaciona un recurso con el título propiamente dicho (el nombre principal de un recurso, es decir, el título de un recurso en la forma en la que aparece en la fuente preferida de información para el recurso). [Fuente: http://metadataregistry.org/schemapropel/list/schema_property_id/1945.html]
comment: Relates a resource to the title proper (the chief name of a resource, i.e. the title of a resource in the form in which it appears on the preferred source of information for the resource). [Source: http://metadataregistry.org/schemapropel/list/schema_property_id/1945.html] @en
label: has title proper @en

tiene lugar de publicación, producción, distribución
type: DatatypeProperty
sub property of: P1016
sub property of: P60547
domain: Recurso
comment: Relaciona un recurso con el nombre de un lugar asociado en la fuente de información prescrita con el nombre del editor, productor o distribuidor. [Fuente: http://metadataregistry.org/schemapropel/list/schema_property_id/1957.html]
comment: Relates a resource to the name of the place associated on the prescribed source of information with the name of the publisher, producer or distributor. [Source: http://metadataregistry.org/schemapropel/list/schema_property_id/1957.html] @en
label: has place of publication, production, distribution @en

tiene designación específica del material y extensión
type: DatatypeProperty
sub property of: P1022
sub property of: P60550
domain: Recurso
comment: Relaciona un recurso con una mención incluyendo la designación específica de material, la extension, la mención de paginación (si es un recurso impreso) y la duración (si el recurso tiene un aspecto inherente de duración). [Fuente: http://metadataregistry.org/schemapropel/list/schema_property_id/1963.html]
comment: Relates a resource to a statement including the specific material designation, the extent, the pagination statement (if a printed resource), and the playing time (if the resource has an inherent durational aspect). [Source: http://metadataregistry.org/schemapropel/list/schema_property_id/1963.html] @en
label: has specific material designation and extent @en

tiene mención de forma del contenido y de tipo de medio
type: DatatypeProperty
domain: Recurso
label: Content form @en
label: Tipo de material
label: has content form and media type statement @en

tiene fecha de publicación, producción, distribución
type: DatatypeProperty
sub property of: P1018
sub property of: P60073
domain: Recurso
comment: Relaciona un recurso con la fecha en que oficialmente se ha ofrecido para la venta o distribución al público, normalmente se da en la forma de un año. [Fuente: http://metadataregistry.org/schemapropel/list/schema_property_id/1959.html] Si la fecha no es conocida, puede darse como rango, siglo, o fecha aproximada (ej: 189?, 17??, ca. 1776...)
comment: Relates a resource to the date on which it is officially offered for sale or distribution to the public, usually given in the form of a year. [Source: http://metadataregistry.org/schemapropel/list/schema_property_id/1959.html] If the date is unknown, an approximate date can be supplied (s. XVI, 177?...) @en
label: has date of publication, production, distribution @en

tiene dimensiones
type: DatatypeProperty
sub property of: P1024
sub property of: P60539
domain: Recurso
comment: Relaciona un recurso con una nota sobre sus dimensiones en centímetros (o milímetros si se trata de la anchura de una película o cinta) redondeando al número entero más cercano. [Fuente: http://metadataregistry.org/schemapropel/list/schema_property_id/1965.html]
comment: Relates a resource to a note on its dimensions in centimetres (or millimetres if the gauge of a film or width of a tape) rounded up to the nearest whole. [Source: http://metadataregistry.org/schemapropel/list/schema_property_id/1965.html] @en
label: has dimensions @en

tiene mención de responsabilidad relativa al título
type: DatatypeProperty
sub property of: P1007
sub property of: P60339
domain: Recurso
comment: Relaciona un recurso con uno o más nombres, frases, o grupos de caracteres, transcritos literalmente de la publicación, que están relacionados con la identificación y/o función de cualquier persona o entidad corporativa responsables de, o que contribuyen a, la creación o realización del contenido intelectual o artístico de una obra contenida en el recurso. [Fuente: http://metadataregistry.org/schemapropel/list/schema_property_id/1948.html]
comment: Relates a resource to one or more names, phrases, or groups of characters, transcribed from the resource, relating to the identification and/or function of any persons or corporate bodies responsible for or contributing to the creation or realisation of the intellectual or artistic content of a work contained in the resource. [Source: http://metadataregistry.org/schemapropel/list/schema_property_id/1948.html] @en
label: has statement of responsibility relating to title @en

depósito legal
type: DatatypeProperty
sub property of: P1032
sub property of: P60052
domain: Recurso
comment: Llegal deposit number for an item that was acquired by legal deposit requirements. [Source: adapted from MARC21 Format for Bibliographic data; https://www.loc.gov/marc/bibliographic/bd017.html] @en
comment: Número de registro de depósito legal para un documento que se adquirió mediante depósito legal [Fuente: adaptado de Formato MARC21 para registros bibliográficos: http://www.bne.es/webdocs/Inicio/Perfiles/Bibliotecarios/MARC21_registros-bibliograficos.pdf]
label: Identifier for the manifestation @en

tiene otros detalles físicos
type: DatatypeProperty
sub property of: P1023
sub property of: P60804
domain: Recurso
comment: Relaciona un recurso con una mención que incluye la mención relativa al material del que está hecho el recurso, la mención relativa a la presencia de ilustraciones, el tipo específico de ilustración, el número de ilustraciones, la existencia de color, la proporción de reducción (si es una microforma), la existencia o ausencia de sonido (si es un recurso que pueda tener como carácterística el sonido integrado) y otras especificaciones técnicas. [Fuente: http://metadataregistry.org/schemapropel/list/schema_property_id/1964.html]
comment: Relates a resource to a statement including the statement relating to the material of which the resource is composed, the statement relating to the presence of illustrations, the particular type of illustration, the number of illustrations, the presence of colour, the reduction ration (if a microform), the presence or absence of sound (if a resource that may have integral sound as a feature), and other technical specifications. [Source: http://metadataregistry.org/schemapropel/list/schema_property_id/1964.html] @en
label: has other physical details @en

ISBN
type: DatatypeProperty
sub property of: P1032
sub property of: P60052
domain: Recurso
label: ISBN @en
comment: ISBN number @en
comment: Número de ISBN

tiene información complementaria del título
type: DatatypeProperty
sub property of: P1006
sub property of: P60493
domain: Recurso
comment: Relaciona un recurso con una palabra o expresión, o grupo de caracteres que aparecen en conjunción con y subordinados al título propiamente dicho del recurso. [fuente: http://metadataregistry.org/schemapropel/list/schema_property_id/1947.html ]
comment: Relates a resource to a word or phrase, or a group of characters, appearing in conjunction with, and subordinate to, the title proper of the resource. [source: http://metadataregistry.org/schemapropel/list/schema_property_id/1947.html] @en
label: has other title information @en

tiene nota
type: DatatypeProperty
sub property of: P1045
sub property of: P60470
domain: Recurso
comment: Relaciona un recurso con una nota de información descriptiva que no se ha dado en otras áreas de descripción pero que se considera importante para los usuarios de registros bibliográficos. [fuente: http://metadataregistry.org/schemapropel/list/schema_property_id/1986.html]
comment: Relates a resource to a note of descriptive information that has not been given in other areas of the description but that is considered to be important to users of bibliographic records. [source: http://metadataregistry.org/schemapropel/list/schema_property_id/1986.html] @en
label: has note @en

tiene título propiamente dicho de serie o recurso monográfico multiparte
type: DatatypeProperty
sub property of: P1173
sub property of: P60516
domain: Recurso
comment: Relaciona un recurso que es una serie o un recurso monográfico multiparte con una declaración de su título
comment: Relates a resource that is a series or multipart monographic resource to a statement of its title. [source: http://metadataregistry.org/schemapropel/list/schema_property_id/16494.html] @en
label: has title proper of series or multipart monographic resource @en

tiene mención de edición
type: DatatypeProperty
sub property of: P1008
sub property of: P60329
domain: Recurso
comment: Relaciona un recurso con un término, frase o grupo de caracteres que indican que el recurso pertenece a una edición.[fuente: http://metadataregistry.org/schemapropel/list/schema_property_id/1949.html]
comment: Relates a resource to a word or phrase, or a group of characters, indicating that the resource belongs to an edition. [source: http://metadataregistry.org/schemapropel/list/schema_property_id/1949.html] @en
label: has edition statement @en

tiene numeración de serie o recurso monográfico multiparte
type: DatatypeProperty
sub property of: P1031
sub property of: P60081
domain: Recurso
comment: Relaciona un recurso que es una serie o recurso monográfico multiparte con su numeración. [fuente: http://metadataregistry.org/schemapropel/list/schema_property_id/1972.html]
comment: Relates a resource that is a series or multipart monographic resource to its numbering. [source: http://metadataregistry.org/schemapropel/list/schema_property_id/1972.html] @en
label: has numbering within series or multipart monographic resource @en

tiene nombre de impresor o fabricante
type: DatatypeProperty
sub property of: P1020
sub property of: P60546
domain: Recurso
comment: Relaciona un recurso con el nombre de la persona o entidad corporativa que aparece en el recurso que efectúa la impresión o fabricación del recurso. [fuente: http://metadataregistry.org/schemapropel/list/schema_property_id/1961.html]
comment: Relates a resource to the name of the person or corporate body appearing on the resource that effects the printing or manufacturing of the resource. [source: http://metadataregistry.org/schemapropel/list/schema_property_id/1961.html] @en
label: has name of printer or manufacturer @en

número del editor para música (manifestación)
type: DatatypeProperty
sub property of: P1032
sub property of: P60052
domain: Recurso
comment: Formatted number used for sound recordings, printed music, other music-related materials, and video recordings. [source: MARC 21] @en
comment: Números formateados del editor que se utilizan para grabaciones sonoras, videograbaciones, música impresa y otros materiales relacionados con música. [fuente: MARC 21]
label: publisher's number for music (manifestation) @en

tiene nota sobre descripción del material
type: DatatypeProperty
sub property of: P1040
sub property of: P60470
domain: Recurso
comment: Relaciona un recurso con una nota sobre el área de descripción del material. [fuente: http://metadataregistry.org/schemapropel/list/schema_property_id/1981.html]
comment: Relates a resource to a note on the material description area. [source: http://metadataregistry.org/schemapropel/list/schema_property_id/1981.html] @en
label: has note on material description @en

pertenece a serie
type: DatatypeProperty
domain: Recurso
label: Serie o colección
label: Series @en
comment: Punto de acceso adicional de serie que consta únicamente del título de la serie. [fuente: Marc21]
comment: Series added entry consisting of a series title alone [source: Marc 21] @en
label: is in series @en

tiene nota sobre el contenido
type: DatatypeProperty
sub property of: P1042
domain: Recurso
label: Nota de contenido
label: Note on contents @en
comment: Relaciona un recurso con una nota relativa al contenido. [fuente: http://metadataregistry.org/schemapropel/list/schema_property_id/1983.html]
comment: Relates a resource to a note relating to the contents. [source: http://metadataregistry.org/schemapropel/list/schema_property_id/1983.html] @en
label: has note on contents @en

tiene intérprete
type: DatatypeProperty
sub property of: P1087
sub property of: P60130
domain: Recurso
label: Intérpretes
label: Performers @en
comment: Relaciona un recurso con una nota sobre sus menciones de responsabilidad (menciones, transcritas del recurso que se describe, relacionadas con personas responsables del contenido intelectual o artístico del recurso, con entidades corporativas de los cuales emana el contenido, o con personas o entidades corporativas responsables de la ejecución del contenido del recurso). Incluye menciones de responsabilidad tomadas de fuera del recurso, su contenedor o el material textual que lo acompaña; notas sobre formas variantes o ampliadas de nombres de personas u organismos corporativos, notas sobre seudónimos, notas sobre personas o entidades corporativas relacionadas con el trabajo que no pueden incluirse en otras áreas de la descripción (porque, por ejemplo, su función no está especificada) ; menciones de responsabilidad relacionadas con los apéndices y otros asuntos complementarios que aparecen en el recurso pero no en una fuente de información prescrita; notas sobre la puesta en escena, instrumentación, etc., de trabajos realizados; notas sobre personas u organismos relacionados con la producción técnica, las funciones administrativas y de consultoría del trabajo.
comment: Relates a resource to a note on its statements of responsibility (statements, transcribed from the resource being described, relating to persons responsible for the intellectual or artistic content of the resource, to corporate bodies from which the content emanates, or to persons or corporate bodies responsible for the performance of the content of the resource). Includes statements of responsibility taken from outside the resource, its container or accompanying textual matter; notes on variant or expanded forms of names of persons or corporate bodies, notes on pseudonyms, notes on persons or corporate bodies connected with the work that cannot be included in other areas of the description (because, for example, their function is not specified); statements of responsibility relating to appendices and other supplementary matter appearing on the resource but not on a prescribed source of information; notes on the staging, instrumentation, etc., of performed works; notes on persons or bodies connected with the technical production, administrative and consulting functions of the work. [fuente: http://iflastandards.info/ns/isbd/unc/elements/P1087] @en
label: has performer @en

tiene nota de referencia bibliográfica
type: DatatypeProperty
sub property of: P1064
sub property of: P60215
domain: Recurso
label: Bibliographic reference @en
label: Referencia bibliográfica
label: has note on bibliographic reference @en

tiene nota sobre publicación, producción, distribución, etc.
type: DatatypeProperty
domain: Recurso
label: Nota de publicación
label: Note on publication @en
label: has note on publication, production, distribution, etc. @en

tiene lugar de impresión o fabricación
type: DatatypeProperty
sub property of: P1019
sub property of: P60162
domain: Recurso
comment: Relaciona un recurso al nombre del lugar asociado en el recurso con su impresión o fabricación. [Fuente: http://metadataregistry.org/schemapropel/list/schema_property_id/1960.html]
comment: Relates a resource to the name of the place associated on the resource with its printing or manufacture. [Source: http://metadataregistry.org/schemapropel/list/schema_property_id/1960.html] @en
label: has place of printing or manufacturer @en

variante de título (recurso)
type: DatatypeProperty
sub property of: P60355
domain: Recurso
comment: Formas variantes del título que aparecen en diferentes partes de un documento o como parte del título propiamente dicho, o como una forma alternativa del título cuando esta varía sustancialmente respecto a la mención de título y además contribuye a una mejor identificación del documento. [Fuente: MARC21 http://www.bne.es/webdocs/Inicio/Perfiles/Bibliotecarios/MARC21_registros-bibliograficos.pdf]
comment: Varying forms of the title appearing on different parts of an item or a portion of the title proper, or an alternative form of the title when the form differs substantially from the title statement in title proper field and if they contribute to the further identification of the item. [Source: MARC21 Bibliographic Format https://www.loc.gov/marc/bibliographic/bd246.html] @en
label: variant title (resource) @en

tiene mención de material anejo
type: DatatypeProperty
sub property of: P1025
sub property of: P60249
domain: Recurso
label: Accompanying material @en
label: Material de acompañamiento
comment: Relaciona un recurso con una mencion de material anejo (cualquier parte separada físicamente del recurso que se ha publicado (o existe intención de que se publique) al mismo tiempo y destinado para ser utilizado con el recurso). [Fuente: http://iflastandards.info/ns/isbd/elements/P1025]
comment: Relates a resource to a statement on accompanying material (any physically separable part of the resource that is issued (or intended to be issued) at the same time and intended to be used with the resource). [Fuente: http://iflastandards.info/ns/isbd/unc/elements/P1025] @en
label: has accompanying material statement @en

tiene título dependiente de título propiamente dicho
type: DatatypeProperty
sub property of: P1138
sub property of: P60515
domain: Recurso
comment: Relaciona un recurso con un título que por sí mismo es insuficiente para identificar el recurso y que requiere la adición del título común, o del título del recurso principal o del título de la serie principal. [Fuente: http://metadataregistry.org/schemapropel/list/schema_property_id/2112.html]
comment: Relates a resource to a title that by itself is insufficient to identify the resource and that requires the addition of the common title, or the title of the main resource or the title of the main series. [Source: http://metadataregistry.org/schemapropel/list/schema_property_id/2112.html] @en
label: has dependent title of title proper @en

tiene designación numérica
type: DatatypeProperty
sub property of: P1156
sub property of: P60533
domain: Recurso
label: Chronological or sequential designation @en
label: Fechas o secuencia de la revista
comment: Relaciona un recurso que es una publicación seriada con su designación numérica [fuente:http://iflastandards.info/ns/isbd/unc/elements/P1156 ]
comment: Relates a resource that is a serial to its numeric designation [source: http://iflastandards.info/ns/isbd/unc/elements/P1156 ] @en
label: has numeric designation @en

tiene nota de frecuencia
type: DatatypeProperty
sub property of: P1065
sub property of: P60129
domain: Recurso
label: Frequency @en
label: Periodicidad
comment: Relaciona un recurso que es una publicación seriada con una nota de frecuencia. Relaciona un recurso que es un recurso integrable con una nota de frecuencia de actualizaciones [fuente: http://iflastandards.info/ns/isbd/unc/elements/P1065]
comment: Relates a resource that is a serial to a note on the frequency. Relates a resource that is an integrating resource to a note on the frequency of updates. [source: http://iflastandards.info/ns/isbd/unc/elements/P1065] @en
label: has note on frequency @en

tiene designación de título dependiente de título propiamente dicho
type: DatatypeProperty
domain: Recurso
label: Dependent title @en
label: Título dependiente
label: has dependent title designation of title proper @en

tiene nota de relación con otros recursos
type: DatatypeProperty
domain: Recurso
label: Recurso relacionado
label: Related resource @en
comment: Title of a related resource @en
comment: Título de un recurso relacionado
label: has note on relationship to other resources @en

tiene mención de escala
type: DatatypeProperty
sub property of: P1047
sub property of: P60565
domain: Recurso
label: Escala
label: Scale @en
comment: Relaciona un recurso cartográfico con la razón matemática entre la distancia en el recurso y la medida real que representa, se da como una fracción representativa, expresada como una ratio (1: ). [Fuente: http://iflastandards.info/ns/isbd/elements/P1047]
comment: Relates a resource that is cartographic to the ratio of distances on the resource to the actual distances they represent, given as a representative fraction, expressed as a ratio (1: ). [Source: http://iflastandards.info/ns/isbd/unc/elements/P1047] @en
label: has statement of scale @en

tiene público destinatario
type: DatatypeProperty
sub property of: P1091
sub property of: P60520
domain: Recurso
label: Nota de alcance
label: Note on use @en
comment: Relaciona un recurso con una categoría de usuario destinatario del contenido del recurso, o para el que se considera que el contenido es adecuado
comment: Relates a resource to a category of user for which the content of a resource is intended, or for whom the content is considered suitable. [source: http://rdaregistry.info/Elements/u/#P60520] @en
label: has intended audience @en

tiene nota sobre base de descripción
type: DatatypeProperty
sub property of: P1044
sub property of: P60122
domain: Recurso
label: Basis of descripción @en
label: Descripción basada en:
comment: Relaciona un recurso que es una serie o recurso monográfico multiparte con una nota sobre el fascículo, parte, iteración, etc., en que se basa la descripción [Fuente: http://iflastandards.info/ns/isbd/elements/P1044]
comment: Relates a resource that is a series or multipart monograph to a note on the issue, part, iteration, etc., that forms that basis of its description [Source: http://iflastandards.info/ns/isbd/elements/P1044] @en
label: has note on basis of description @en

tiene condiciones de disponibilidad
type: DatatypeProperty
sub property of: P1034
sub property of: P60521
domain: Recurso
label: Precio
label: Price @en
comment: Relaciona un recurso con una mención del precio si está a la venta o una breve mención de otras condiciones si no está a la venta [fuente: http://iflastandards.info/ns/isbd/unc/elements/P1034]
comment: Relates a resource to a statement of the price if it is for sale or a brief statement of other terms if it is not for sale [source: http://iflastandards.info/ns/isbd/unc/elements/P1034] @en
label: has terms of availability @en

tiene ISSN
type: DatatypeProperty
sub property of: P1030
sub property of: P60534
domain: Recurso
label: ISSN @en
comment: Relaciona un recurso con un identificador que ha sido asignado a una serie por una agencia de ISSN
comment: Relates a resource to an identifier that is assigned to a series by an ISSN registration agency [source: http://www.rdaregistry.info/Elements/u/#P60534] @en
label: has ISSN @en

tiene nota de tesis
type: DatatypeProperty
sub property of: P1073
sub property of: P60489
domain: Recurso
label: Nota
label: Note @en
comment: Relaciona un recurso con una mención que identifica una institución académica, grado y año en que el recurso fue presentado
comment: Relates a resource to a statement that identifies an academic institution, degree, and year for which a resource was presented [source: http://www.rdaregistry.info/Elements/u/#P60489] @en
label: has note on dissertation or thesis @en

tiene identificador normalizado
type: DatatypeProperty
sub property of: P1154
sub property of: P60052
domain: Recurso
label: Other standard identifier @en
label: Otros números normalizados
comment: Relaciona un recurso con un número identificador normalizado(NIPO, ISMN, EAN...) [fuente: http://iflastandards.info/ns/isbd/elements/P1154 ]
comment: Relates a resource to a standard identifier number (DOI, NIPO, ISMN, EAN) [source: http://iflastandards.info/ns/isbd/elements/P1154 ] @en
label: has standard identifier @en

tiene nota sobre tipo de material o tipo específico de recurso
type: DatatypeProperty
sub property of: P1038
domain: Recurso
label: Nota
label: Note @en
comment: Relaciona un recurso con una nota sobre el área de material o tipo específico de recurso [fuente: http://iflastandards.info/ns/isbd/unc/elements/P1038]
comment: Relates a resource to a note on the material or type of resource specific area [source: http://iflastandards.info/ns/isbd/unc/elements/P1038] @en
label: has note on material type or resource specific type @en

tiene nota sobre el área de edición e historia bibliográfica
type: DatatypeProperty
sub property of: P1038
sub property of: P60135
domain: Recurso
label: Nota sobre la edición
label: Note on edition @en
comment: Relaciona un recurso con una nota sobre el area de edición e historia bibliográfica. [fuente: http://iflastandards.info/ns/isbd/unc/elements/P1037]
comment: Relates a resource to a note on its edition area and bibliographic history. [source: http://iflastandards.info/ns/isbd/unc/elements/P1037] @en
label: has note on edition area and bibliographic history @en

tiene nota de requisitos mínimos del sistema
type: DatatypeProperty
sub property of: P1066
sub property of: P60528
domain: Recurso
label: Requisitos del sistema
label: System requirements @en
comment: Relaciona un recurso electrónico de acceso directo con una nota sobre los requisitos del sistema para el uso del recurso. [fuente: http://iflastandards.info/ns/isbd/unc/elements/P1066]
comment: Relates a resource that is a direct access electronic resource to a note on system requirements for use of the resource. [source: http://iflastandards.info/ns/isbd/unc/elements/P1066] @en
label: has note on system requirements @en

tiene título dependiente de serie o recurso monográfico multiparte
type: DatatypeProperty
domain: Recurso
label: Dependent title of series @en
label: Título dependiente de la serie
label: has dependent title of series or multipart monographic resource @en

tiene nota sobre la relación con recursos continuados
type: DatatypeProperty
domain: Recurso
label: Nota
label: has note on relationship between continuing resources @en

tiene nota de reproducción
type: DatatypeProperty
sub property of: P1098
sub property of: http://rdaregistry.info/Elements/u/#60297
domain: Recurso
label: Nota de versión original
label: Reproduction note @en
comment: Relaciona un recurso que es una reproducción exacta de otro recurso con una nota sobre el título del recurso original (cuando es diferente del de la reproducción) y sus datos de publicación [fuente: http://iflastandards.info/ns/isbd/unc/elements/P1098]
comment: Relates a resource that is is an exact reproduction of another resource to a note on the title of the original resource (when different from the title of the reproduction) and its publication details. [source: http://iflastandards.info/ns/isbd/unc/elements/P1098] @en
label: has note on reproduction @en

tiene fecha de impresión o fabricación
type: DatatypeProperty
domain: Recurso
label: Date of impression or manufacturing @en
label: Fecha de impresión o fabricación
label: has date of printing or manufacturer @en

tiene número normalizado internacional de serie o recurso monográfico multiparte
type: DatatypeProperty
domain: Recurso
label: ISSN de la serie
label: Series ISSN @en
label: has international standard number of series or multipart monographic resource @en

tiene mención de responsabilidad relativa a edición
type: DatatypeProperty
domain: Recurso
label: Edition statement @en
label: Mención de edición
label: has statement of responsibility relating to edition @en

tiene mención de formato musical
type: DatatypeProperty
sub property of: P1014
sub property of: P60488
domain: Recurso
label: Formato musical
comment: Formato musical
comment: Music format @en
comment: Relaciona un recurso de música notada con un término o frase que representa la forma física en la cual se presenta.[Fuente: http://iflastandards.info/ns/isbd/elements/P1014]
comment: Relates a resource that is notated music to a term or phrase representing the physical form in which it is presented. [Source: http://iflastandards.info/ns/isbd/unc/elements/P1014] @en
label: has music format statement @en

tiene nota de serie o recurso monográfico multiparte
type: DatatypeProperty
sub property of: P1041
sub property of: P60101
domain: Recurso
label: Nota de serie
label: Series note @en
comment: Relates a resource to a note on the series and monographic resources area. [Source: http://iflastandards.info/ns/isbd/unc/elements/P1041] @en
comment: Tiene nota de serie o recurso monográfico multiparte [Fuente: http://iflastandards.info/ns/isbd/elements/P1041]
label: has note on series and multipart monographic resources @en

tiene designación de título dependiente de serie o recurso monográfico multiparte
type: DatatypeProperty
domain: Recurso
label: Dependent title of series @en
label: Título dependiente de la serie
label: has dependent title designation of series or multipart monographic resource @en

tiene nota de suplemento a o de insertado en
type: DatatypeProperty
domain: Recurso
label: Suplement to or insert in: @en
label: Suplemento o parte de
label: has note on supplement to or insert in @en

tiene nota de suplementos, insertos, etc
type: DatatypeProperty
sub property of: P1100
sub property of: P60281
domain: Recurso
label: Suplementos:
label: Suplements: @en
comment: Relaciona un recurso que tiene uno o más suplementos y/o insertos con una nota sobre el título, el título clave e ISSN del suplemento y/o el inserto [Fuente: http://iflastandards.info/ns/isbd/elements/P1100]
comment: Relates a resource that has one or more supplements and/or inserts to a note on the title, the key title and ISSN of the supplement and/or insert [Source: http://iflastandards.info/ns/isbd/elements/P1100] @en
label: has note on supplements, inserts, etc. @en

mención de coordenadas
type: DatatypeProperty
sub property of: P60109
domain: Recurso
label: Coordenadas
label: Coordinates @en
label: has coordinates statement @en

Coordenadas - Longitud Oeste
type: DatatypeProperty
domain: Recurso
label: Longitud Oeste
label: Westernmost longitude @en
label: Coordinates - westernmost longitude @en

tiene nota sobre modo de acceso
type: DatatypeProperty
domain: Recurso
label: Nota sobre modo de acceso
label: Note on mode of access @en
label: has note on mode of access @en

tiene identificador tipográfico
type: DatatypeProperty
domain: Recurso
label: Fingerprint @en
label: Identificador topográfico
label: has fingerprint @en

tiene nota sobre la encuadernación
type: DatatypeProperty
domain: Recurso
label: Nota sobre la encuadernación @en
label: Note on binding @en
label: has note on binding @en

tiene forma del contenido
type: DatatypeProperty
sub property of: P1003
sub property of: P60049
domain: Recurso
label: Content form @en
label: Forma del contenido
comment: A categorization that reflects the fundamental form of communication in which the content is expressed [source: RDA]. Values are taken from RDA Content type (in Spanish), https://www.rdaregistry.info/termList/RDAContentType/ or from ISBD Content Type (see http://www.bne.es/export/sites/BNWEB1/es/Inicio/Perfiles/Bibliotecarios/Docs/ISBDArea0.pdf) @en
comment: Categoría(s) que refleja la forma fundamental en que se comunica el contenido de una obra. Los valores están tomado de la lista RDA Tipo de Contenido (es español),https://www.rdaregistry.info/termList/RDAContentType/ , y, antes de ello, de la lista de Tipo de Contenido de ISBD, http://www.bne.es/export/sites/BNWEB1/es/Inicio/Perfiles/Bibliotecarios/Docs/ISBDArea0.pdf
label: has content form @en

tiene tipo de medio
type: DatatypeProperty
sub property of: P1185
sub property of: P60050
domain: Recurso
label: Media type @en
label: Tipo de medio
comment: A categorization reflecting the general type of intermediation device required to view, play, run, etc., the content of a manifestation. Values taken from RDA Media Type (in Spanish), https://www.rdaregistry.info/termList/RDAMediaType/, or, before that, ISBD Media Type, http://www.bne.es/export/sites/BNWEB1/es/Inicio/Perfiles/Bibliotecarios/Docs/ISBDArea0.pdf @en
comment: Una categoría que refleja si el recurso necesita de algún aparato o sistema de intermediación para acceder a su contenido. Los valores están tomados de la lista RDA Media Type (en español), https://www.rdaregistry.info/termList/RDAMediaType/, o en datos más antiguos, Tipo de Medio de ISBD, http://www.bne.es/export/sites/BNWEB1/es/Inicio/Perfiles/Bibliotecarios/Docs/ISBDArea0.pdf
label: has media type @en

tiene ascensión recta y declinación
type: DatatypeProperty
sub property of: P60346
domain: Recurso
label: Cartographic mathematical data @en
label: Datos matemáticos cartográficos
comment: En un mapa, sistema para identificar la localización de un objeto celeste en el cielo mediante los ángulos de la ascensión recta y declinación. @en
comment: Relates a resource to a system for identifying the location of a celestial object in the sky covered by the cartographic content of a resource using angles of right ascension and declination. [source: RDA] @en
label: has right ascension and declination @en

tipo de recurso
type: DatatypeProperty
sub property of: P60058
domain: Recurso
label: Tipo de recurso
comment: Descripción genérica del tipo de recurso. Valores: Grabados Registro sonoro musical Registro sonoro Música impresa Libro Vídeo Material cartográfico Música manuscrita Material cartográfico manuscrito Fotografías Manuscrito Prensa y revistas Dibujos, grabados y fotografías Dibujos Archivo de ordenador
comment: Generic description of type of resource. Values: Grabados Registro sonoro musical Registro sonoro Música impresa Libro Vídeo Material cartográfico Música manuscrita Material cartográfico manuscrito Fotografías Manuscrito Prensa y revistas Dibujos, grabados y fotografías Dibujos Archivo de ordenador @en
label: type of resource @en

tiene nota de incipit
type: DatatypeProperty
sub property of: P1045
sub property of: P60470
domain: Recurso
label: Nota
comment: First and last words from a manuscript @en
comment: Primeras y últimas palabras de un manuscrito
label: has note of incipit @en

Miniatura
type: DatatypeProperty
label: imagen asociada
comment: Imagen tomada de Biblioteca Digital Hispánica sobre la que acciona el link que enlaza con la digitalización del recurso
comment: Resource Image taken from Biblioteca Digital Hispánica on which the link to the digitalization is placed @en
label: associated image @en
label: thumbnail @en

Resumen
type: DatatypeProperty
comment: Biographical note extracted from Wikipedia: (dbpedia:abstract) @en
comment: Nota biográfica extraída de Wikipedia (dpbedia:abstract)
label: abstract @en

Datos del editor o distribuidor
type: DatatypeProperty
sub property of: P60490
label: Datos del editor o distribuidor

Título abreviado
type: DatatypeProperty
label: Título abreviado
label: Short title (Serials) @en

Título clave
type: DatatypeProperty
label: Key title @en
label: Título clave
label: Key title (Serials) @en

Nota sobre la numeración
type: DatatypeProperty
label: Nota de numeración
label: Note on numeration @en
label: Note on numbering @en

Otros términos relacionados
type: DatatypeProperty
comment: Other terms related to a resource regarding their subject, genre or form, taken from an uncontrolled list other than http://datos.bne.es/def/materias or http://datos.bne.es/def/generoforma @en
comment: Otros términos relativos a la materia, género o forma de un recurso, no tomado de ninguna lista de valores, como http://datos.bne.es/def/materias o http://datos.bne.es/def/generoforma
label: Other related subject terms @en

Periodicidad anterior
type: DatatypeProperty
label: Periodicidad anterior
comment: Mención completa, sin fechas, de la periodicidad que anteriormente tenía el documento (generalmente una publicación periódica)
comment: The complete statement, exclusive of dates, of the former publication frequency. (ussually referred to a serials) @en
label: Former publication frequency @en

ISSN correcto
type: DatatypeProperty
label: ISSN
label: ISSN number @en

ISSN cancelado
type: DatatypeProperty
label: ISSN (cancelado)
label: Cancelled or invalid ISSN number @en

Cualificador del título abreviado
type: DatatypeProperty
label: Cualificador título abreviado

Cualificador del título clave
type: DatatypeProperty
label: Cualificador del título clave

Fecha de comienzo de la periodicidad actual
type: DatatypeProperty
sub property of: P60998
domain: Recurso
comment: Beginning date ot the current publication frequency serial. Dates are included when the beginning date of the current frequency is not the same as the beginning date of publication. @en
comment: Fecha de inicio de la periodicidad actual de una publicación periódica. Se incluyen fechas cuando la fecha de comienzo de la periodicidad actual no es la misma que la fecha de comienzo de la publicación
label: Date of current publication frequency @en

Fechas de la antigua periodicidad
type: DatatypeProperty
sub property of: P60538
domain: Recurso
comment: Dates of former publication frequency or a serial, when a current publication frequency is given @en
comment: Fechas de la periodicidad anterior de una publicación periódica, cuando, cuando existe una periodicidad actual.
label: Dates of former publication frequency @en

Área de difusión (Comunidad Autónoma)
type: DatatypeProperty
label: Área de difusión (Comunidad Autónoma)

Área de difusión (Provincia)
type: DatatypeProperty
label: Área de difusión (Provincia)

Área de difusión (Localidad)
type: DatatypeProperty
label: Área de difusión (Localidad)

Área de difusión (Barrio)
type: DatatypeProperty
label: Área de difusión (Barrio)

País relacionado
type: DatatypeProperty
sub property of: P61014
domain: Recurso
comment: Country Region related to the resource: in serials and old books, is place of publication, and, in maps, geographic area @en
comment: País relacionado con el recurso. Puede hacer referencia al lugar de publicación (en publicaciones periódicas o fondo antiguo), o al lugar geográfico de un mapa
comment: Related country @en

Comunidad autónoma relacionada
type: DatatypeProperty
sub property of: P61014
domain: Recurso
label: Related region @en
comment: Comunidad autónoma relacionada con el recurso. Puede hacer referencia al lugar de publicación (en publicaciones periódicas o fondo antiguo), o al lugar geográfico de un mapa
comment: Region related to the resource: in serials and old books, is place of publication, and, in maps, geographic area @en

Provincia relacionada
type: DatatypeProperty
sub property of: P61014
domain: Recurso
comment: Provincia relacionada con el recurso. Puede hacer referencia al lugar de publicación (en publicaciones periódicas o fondo antiguo), o al lugar geográfico de un mapa
comment: Region related to the resource: in serials and old books, is place of publication, and, in maps, geographic area @en
label: Related province @en

Localidad relacionada
type: DatatypeProperty
sub property of: P61014
domain: Recurso
comment: City or town related to the resource: in serials and old books, is place of publication, and, in maps, geographic area @en
comment: Ciudad o pueblo relacionado con el recurso. Puede hacer referencia al lugar de publicación (en publicaciones periódicas o fondo antiguo), o al lugar geográfico de un mapa
label: Related city or town @en

Tipo de recurso relacionado
type: DatatypeProperty
label: Tipo de recurso relacionado
label: Type or related resource @en

Mención de proyección (mapa)
type: DatatypeProperty
sub property of: P60542
domain: Recurso
comment: Medio o sistema utilizado para representar la superficie de la Tierra o de una esfera celeste en un plano. [fuente: RDA]
comment: Relates a resource to a method or system used to represent the surface of the earth or of a celestial sphere on a plane [source: RDA} @en
label: Projection (map) @en

Signatura
type: DatatypeProperty
domain: Ejemplar
comment: Call number, that is, a combination of letters and numbers used for finding an object in the library. In BNE, this numbers conveys no implicit meaning. Check http://www.bne.es/export/sites/BNWEB1/es/Catalogos/TablaSignaturas/SignaturasWebBNE.pdf for more info for call numbers used at the BNE @en
comment: Signatura, esto es, conjunto de números y letras que indica dónde está colocado el objeto. En BNE, en general, esta ordenación es correlativa y no tiene ningún significado semántico. Consulte http://www.bne.es/export/sites/BNWEB1/es/Catalogos/TablaSignaturas/SignaturasWebBNE.pdf para más información sobre signaturas
label: Call number @en

Número de copias
type: DatatypeProperty
domain: Ejemplar
label: Número de copias
comment: Number of copies the library own @en
comment: Número de ejemplares que la biblioteca posee de la edición
label: Number of copies @en

Fecha de último prestamo
type: DatatypeProperty
domain: Ejemplar
label: Fecha del último préstamo
comment: Last loan date @en

Fecha de última devolución
type: DatatypeProperty
domain: Ejemplar
label: Fecha de última devolución
comment: Last return from a loan Date @en

Codigo de barras
type: DatatypeProperty
domain: Ejemplar
label: Barcode @en

Número de piezas
type: DatatypeProperty
domain: Ejemplar
label: Número de piezas
comment: Number of constituent units @en
label: Number of units @en

Localización
type: DatatypeProperty
domain: Ejemplar
label: Localización
comment: Code identifying the reading room where the item can be consulted BARBI_ANTI Sala Barbieri-Petición anticipada (Music) CERV_ANTI Sala Cervantes-Petición anticipada (Rare Books) CONSERVACI Ejemplar de conservación (Preservation item, not for loan) EN_LINEA Online resource GOYA-ANTI Sala Goya. Bellas Artes-Petición anticipada (Graphic Arts) GOYA-CARTO Sala Goya. Cartografía (Maps) INF_BIBLIO Sala Información Bibliográfica (Bibliographic Information) INPROCESS In process, not yet available MISSING Missing item REF_ALCALA Sala de Alcalá de Henares REF_CARTO Sala Goya. Cartografía. Referencia (Maps. Reference room) REF_SALON Salón General. Referencia (Modern books, Reference room)) REF_SBARBI Sala Barbieri. Referencia (Music, Reference room)) REF_SCERV Sala Cervantes. Referencia (Rare Books & manuscripts, Reference room) REF_SGOYA Sala Goya. Bellas Artes. Referencia (Graphic Arts, Reference room)) REF_SPR Sala de Prensa y Revistas. Referencia (Serials, Reference room)) SALA_BARBI Sala Barbieri (Music reading room) SALA_CERV Sala Cervantes (Rare Books & Manuscript; Reference room) SALA_GOYA Sala Goya. Bellas Artes (Graphic Arts,Reference room) SALA_SPR Sala de Prensa y Revistas (Seriasl ,Reference room) SDB SDB (Servicio Documentación Bibliotecaria) (Library Documentation Center) SG_PETANTI Salón General-Petición anticipada (Modern books) SG_RECOLET Salón General (Modern books reading room) SPR_ANTI Sala de Prensa y Revistas-Petición anticipada (Serials) @en
comment: Código que indica en qué sala se debe solicitar el objeto. Valores más comunes: BARBI_ANTI Sala Barbieri-Petición anticipada CERV_ANTI Sala Cervantes-Petición anticipada CONSERVACI Ejemplar de conservación EN_LINEA En línea (para recursos no tangibles) GOYA-ANTI Sala Goya. Bellas Artes-Petición anticipada GOYA-CARTO Sala Goya. Cartografía INF_BIBLIO Sala Información Bibliográfica INPROCESS EN PROCESO. NO DISPONIBLE PARA PRÉSTAMO MISSING Extraviado REF_ALCALA Sala de Alcalá de Henares REF_CARTO Sala Goya. Cartografía. Referencia REF_SALON Salón General. Referencia REF_SBARBI Sala Barbieri. Referencia REF_SCERV Sala Cervantes. Referencia REF_SGOYA Sala Goya. Bellas Artes. Referencia REF_SPR Sala de Prensa y Revistas. Referencia SALA_BARBI Sala Barbieri SALA_CERV Sala Cervantes SALA_GOYA Sala Goya. Bellas Artes SALA_SPR Sala de Prensa y Revistas SDB SDB (Servicio Documentación Bibliotecaria) SG_PETANTI Salón General-Petición anticipada SG_RECOLET Salón General SPR_ANTI Sala de Prensa y Revistas-Petición anticipada
label: Item location @en

Biblioteca
type: DatatypeProperty
domain: Ejemplar
label: Biblioteca
comment: This value indicates whether the item is located in the Madrid (BNMADRID) or Alcalá (BNALCALA) buildings @en
comment: Valor que indica si el ejemplar se localiza en la sede de la BNE de Madrid (BNMADRID) o de Alcalá (BNALCALA)
label: Library branch @en

Número de prestamos
type: DatatypeProperty
domain: Ejemplar
label: Número de préstamos
label: Total number of loans @en

Tipo y contenido de nota
type: DatatypeProperty
domain: Ejemplar
label: Nota sobre el ejemplar
label: Note on item @en

Precio
type: DatatypeProperty
domain: Ejemplar
label: Precio
label: Price @en

Circula
type: DatatypeProperty
domain: Ejemplar
label: Circula
label: Circulation value @en

Permanente
type: DatatypeProperty
domain: Ejemplar
label: Permanente

Item type code
type: DatatypeProperty
domain: Ejemplar
comment: Código de tipo de ítem. Valores: CCPPNOVUM Catálogo Colectivo EXCLUIDO_P Excluido préstamo (preservación) FONDO_ANTI Fondo anterior a 1958 FONDO_MODE Fondo posterior a 1957 FONDO_RESE Fondo reservado MAT_ESPECI Materiales especiales (CDs, DVDs, vídeos, etc.) NO_PRESTA Préstamo restringido PUB_ELEC Publicación electrónica REFERENCIA Obra de referencia REP_DIGIT Reproducción digital REP_FOTO Reproducción fotográfica REP_MICRO Reproducción en microforma SDB_CONSUL Ejemplar de consulta del SDB SDB_PRESTA Ejemplar prestable del SDB SERIADA Seriada UNKNOWN Desconocido
comment: Item type code. Values: CCPPNOVUM Colective Catalogue EXCLUIDO_P Retired from circulation for preservation reaso FONDO_ANTI Edition published before 1958 FONDO_MODE Editions published after 1958 FONDO_RESE Not available for loan. Reserved MAT_ESPECI Other special materials (CDs, DVDs, vídeos, etc.) NO_PRESTA Restricted from loan PUB_ELEC Electronic publication REFERENCIA Reference rooms REP_DIGIT Digital reproduction REP_FOTO Photographic reproduction REP_MICRO Microform SDB_CONSUL Library Documentation Center. Reference room SDB_PRESTA Library Documentation Center. Available for takeaway loan SERIADA Serials UNKNOWN @en

Fecha de creación del item
type: DatatypeProperty
domain: Ejemplar
label: Fecha de creación
label: Date of item record creation @en

Esquema de clasificación de la signatura
type: DatatypeProperty
domain: Ejemplar
label: Esquema de clasificación de signatura

Tipo de material
type: DatatypeProperty
domain: Ejemplar
label: Tipo de material
comment: Tipo de material. Valores GRABADO CD_AUDIO UNKNOWN PARTITURA MONO_ANTIG MONO_MODER OTROS ROLLO_PIAN DVD ENCUADERNA MAPA DIAPO MENORES MICROFILM MAPAMANUN DIB_TECNIC MICROFORMA DIBUJO REPDIGITAL MANUSCRITO CD-ROM MULTIMEDIA MICROFICHA POSTALES SERI_EXTRA PLANO LIBCABALLE SERI_MODER SERI_ANTIG TEM_OPOSIC EJEMPLARBD FOTOGRAFIA DIS_VINILO CD-DVD_SER CASETE DIS_PIZARR ARCH_PERSO DISQUETES CARTUCHO ARCHIVO_BN CARTEL VIDEO_VHS CAHILOMAG USB REPFOTOGRA EPHIMERA BLU-RAY INCUNABLE PPOETICOS C_N_LATINO VILLANCICO EX_LIBRIS EN_LINEA VIDEO_BETA
comment: Type of material. Values GRABADO CD_AUDIO UNKNOWN PARTITURA MONO_ANTIG MONO_MODER OTROS ROLLO_PIAN DVD ENCUADERNA MAPA DIAPO MENORES MICROFILM MAPAMANUN DIB_TECNIC MICROFORMA DIBUJO REPDIGITAL MANUSCRITO CD-ROM MULTIMEDIA MICROFICHA POSTALES SERI_EXTRA PLANO LIBCABALLE SERI_MODER SERI_ANTIG TEM_OPOSIC EJEMPLARBD FOTOGRAFIA DIS_VINILO CD-DVD_SER CASETE DIS_PIZARR ARCH_PERSO DISQUETES CARTUCHO ARCHIVO_BN CARTEL VIDEO_VHS CAHILOMAG USB REPFOTOGRA EPHIMERA BLU-RAY INCUNABLE PPOETICOS C_N_LATINO VILLANCICO EX_LIBRIS EN_LINEA VIDEO_BETA @en
label: Type of resource @en

Procedencia
type: DatatypeProperty
domain: Ejemplar
label: Procedencia
comment: Identifica el medio de adquisición del ejemplar. Los valores más habituales son: Depósito Legal, Compra, Canje, Donativo Personall, Donativo Institucional. Si proceden de alguna colección destacada, se identifica por el apellido de la persona o institucion: ej., Gayangos, Usoz, Dirección General de Marruecos
comment: Identify the means of acquisition. Most usual values identifity items acquired by Purchase (Compra), Exchange (Canje), Personal or Institutional Donation (Donativo Personal; Donativo Institucional). If the items belongs to an important donor, it is identified by surname, or name of the institution (Gayangos, Usoz) @en
label: Provenance @en

tiene nombre preferido de persona
type: DatatypeProperty
sub property of: P50117
domain: Persona
label: Name @en
label: Nombre
comment: Nombre con el se identifica comúnmente a una persona. Puede ser un nombre propio, una combinación y nombre, un apodo o seudónimo, un título de la realeza o nobleza, un nombre de religión...
comment: Preferred name for the person. It is the most commonly name related to the author. It can be a given name, a surname or surmanes plus a given name, a pseudonym, a royal title, a religious name... @en
label: has preferred name of person @en

tiene fechas de persona
type: DatatypeProperty
domain: Persona
label: Dates @en
label: Fechas asociadas
comment: Dates of birth/dearth/activity of the persons, added to the preferred name to distinguish the name from other similar, or to assist in identification @en
comment: Fechas de nacimiento, muerte o actividad, que acompañan al Nombre para ayudar a su identificación o deshacer una homonimia
label: has dates of person @en

tiene calificativo de persona
type: DatatypeProperty
domain: Persona
label: Title, rank or office @en
label: Título, rango, oficio o cargo
comment: Otros calificativos que se añaden al nombre preferido para ayudar a su identificación o distinguirlo de otros similares. Puede incluir títulos nobiliarios, cargos políticos, siglas de órdenes religiosos, profesión, apodos.
comment: Titles and other words associated with a preferred name included to assist in the identification Includes qualifying information such as titles designating rank, office, or nobility, e.g., Sir terms of address, e.g., Mrs. initials of an academic degree or denoting membership in an organization, e.g., F.L.A. Religious orders acronyms. other words or phrases associated with the name, e.g., clockmaker, Saint. [source: adapted from MARC: https://www.loc.gov/marc/authority/adx00.html] @en
label: has title of person @en

nombre completo (persona)
type: DatatypeProperty
domain: Persona
label: Forma completa del nombre
label: Fuller form of name @en
comment: Forma más completa del Nombre Preferido de la persona, con el fin de mejorar su identificación P5001: Garrido, Javier P5004: Garrido Ariza
comment: More complete form of the Preferred Name, used for improved identification: Ex: P5001: Garrido, Javier P5004: Garrido Ariza @en
label: fuller form of name (person) @en

Otra información relacionada con la persona
type: DatatypeProperty
domain: Persona
label: Other biographical or historical data @en
label: Otros datos biográficos o históricos
comment: Dato biográfico (lugar de nacimiento o residencia, fecha) o nota biográfica completa relativa a la persona
comment: Other biographical data (place of birth or residence, dates) or a full biographical sketch @en
label: Other information related to the person @en

persona relacionada (persona)
type: DatatypeProperty
domain: Persona
label: Persona relacionada
label: Related person @en
comment: Nombre preferido de la persona relacionada a la que se refiere P5008
comment: Preferred name of the related person referred in P5008 @en
label: related person (person) @en

Numeración (Personas)
type: DatatypeProperty
domain: Persona
label: Numeración
label: Numeration @en
comment: Número romano parte de un nombre propio. Ejemplos: Benedicto XVI, Alfonso XII
comment: Roman numeral or a roman numeral and a subsequent part of a forename. Ex: Benedict XVI; Elizabeth II @en
label: Numeration (Persons) @en

tiene pseudónimo o grupo relacionado
type: DatatypeProperty
domain: Persona
label: Nota sobre seudónimos
label: Note on pseudonyms @en
comment: Nota sobre una identidad alternativa del autor, bien un seudónimo, personal o colectivo, o su nombre real, con el que también el autor ha publicado, o bien con una entidad corporativa con la que la persona está relacionada
comment: Note on an alternate persona (personal or collective pseudonym or the real name) under which the author has also published, or on a corporate body related with the person @en
label: has pseudonymous persona or related corporate body @en

entidad relacionada (persona)
type: DatatypeProperty
domain: Persona
label: Entidad o grupo relacionado
label: Related group or body @en
comment: Nombre preferido de la entidad relacionada con la persona a la que se refiere P5008
comment: Preferred name of the related corporate body referred in P5008 @en
label: related corporate body (person) @en

fecha de nacimiento
type: DatatypeProperty
sub property of: P50121
domain: Persona
label: fecha de nacimiento
comment: Birth date of a person; it may incluye an approximate date of birth if precise date is unknown. @en
comment: Fecha de nacimiento de una persona. Puede tratarse de una fecha aproximada si la fecha precisa es desconocida
label: date of birth @en

fecha de fallecimiento
type: DatatypeProperty
sub property of: P50120
domain: Persona
label: date of death @en
label: fecha de fallecimiento
comment: Death date of a person; it may incluye an approximate date if precise date is unknown. @en
comment: Fecha de fallecimiento de una persona. Puede tratarse de una fecha aproximada si la fecha precisa es desconocida

Otro nombre de la persona no seleccionado como el nombre preferido (P5001)
type: DatatypeProperty
sub property of: P50103
domain: Persona
label: Other name of person that is not selected as the preferred form (P5001) @en
label: Variant name of person @en
label: Variante de nombre de persona

tiene nombre de entidad corporativa
type: DatatypeProperty
sub property of: P50041
domain: Entidad Corporativa
label: Name @en
label: Nombre
comment: Name by which a corporate body or conference is commonly identified. It can be a full or abbreviated form, or an acronym or initials. @en
comment: Nombre con el se identifica comúnmente a una entidad corporativa o congreso. Puede ser su nombre completo, abreviado o siglas o acrónimos. @en
label: has name of the corporate body @en

subordinada jerárquica
type: DatatypeProperty
domain: Entidad Corporativa
label: Entidad subordinada
label: Subordinate unit @en
comment: Name of a corporate body that is a hierarchical subordinate to the corporate expressed in P6001 @en
comment: Nombre de una entidad corporativa subordinada jerárquicamente a la expresada en P6001
label: has hierarchical subordinate @en

Fecha del congreso
type: DatatypeProperty
sub property of: P60526
domain: Entidad Corporativa
label: Date of meeting @en
label: Fecha del congreso
comment: Date or range of dates on which a conference, congress, meeting, exhibition, fair, festival, etc., was held. [source: RDA] @en
comment: Fecha o fechas de la celebración de una conferencia o congreso

Lugar de celebración de una conferencia o congreso
type: DatatypeProperty
domain: Entidad Corporativa
label: Lugar del congreso o exhibición
label: Place of conference or exhibition @en
comment: Place in which a conference, congress, meeting, exhibition, fair, festival, etc., was held. [source: RDA] @en
label: Place of a conference of meeting @en

tiene otra variante de nombre (entidad corporativa)
type: DatatypeProperty
domain: Entidad Corporativa
label: Other variant name @en
label: Variantes del nombre
comment: Other name of the corporate body that is not selected as the preferred form (Pb001) @en
comment: Otro nombre de la entidad corporativa no seleccionado como el nombre preferido (P6001)
label: has other variant name (corporate body) @en

Número del congreso
type: DatatypeProperty
sub property of: P60079
domain: Entidad Corporativa
label: Number of meeting @en
label: Número del congreso o exposición
comment: Designación de la secuencia ordinal numérica de una conferencia o congreso, dentro de la serie de conferencias o congresos.
comment: Designation of a sequencing of a conference, etc., within a series of conferences, etc. [source: RDA] @en
label: Number of conference @en

entidad relacionada (entidad corporativa)
type: DatatypeProperty
domain: Entidad Corporativa
label: Entidad o grupo relacionado
label: Related group or body @en
comment: Nombre preferido de la entidad relacionada mencionada en P6008
comment: Preferred name of the related corporate body referred in P6008 @en
label: related corporate body (corporate body) @en

nota sobre la entidad corporativa
type: DatatypeProperty
domain: Entidad Corporativa
label: Nota
label: Note @en
comment: Nota sobre la entidad corporativa que contiene datos históricos o de relación con otras entidades corporativas o personas
comment: Note containing information on the corporate body or about relationships with other corporate bodies or persons @en
label: note on corporate body @en

persona relacionada (entidad corporativa)
type: DatatypeProperty
domain: Entidad Corporativa
label: Persona relacionada
label: Related person @en
comment: Nombre preferido de la persona relacionada con la entidad corporativa a la que se refiere P6008
comment: Preferred name of the related person referred in P5008 @en
label: related person (corporate body) @en

Depósito Legal (fondo)
type: DatatypeProperty
domain: Fondos
comment: Legal Deposit number of the holding @en
comment: Número de depósito legal correspondiente al ejemplar
label: Legal Deposit number (holding) @en

ISBN
type: DatatypeProperty
domain: Fondos
comment: Item's ISBN number @en
comment: Número de ISBN del ejemplar

ISSN
type: DatatypeProperty
domain: Fondos
comment: ISSN @en
comment: Item's ISNN number @en
comment: Número ISSN del ejemplar

Número NIPO
type: DatatypeProperty
domain: Fondos
comment: Item's NIPO (Spanish Official Publication Identification Number) @en
comment: Número NIPO (Número de Identificación de la Publicación Oficial) del ejemplar
label: NIPO number @en

Forma de adquisición
type: DatatypeProperty
sub property of: P40050
domain: Fondos
comment: Method of acquisition. It may contain the values: Compra, Compra en subasta, Donativo, Canje, Biblioteca depositaria, Depósito, Legado, Legado (ab intestato) @en
comment: Método de adquisición del ejemplar. Puede contener alguno de estos valores: Compra, Compra en subasta, Donativo, Canje, Biblioteca depositaria, Depósito, Legado, Legado (ab intestato)
label: Method of acquisition @en

Nombre del antiguo poseedor
type: DatatypeProperty
sub property of: P60401
domain: Fondos
comment: Full name of the item's former owner (person or corporate body) @en
comment: Nombre completo del antiguo propietario del ejemplar
label: Former owner @en

Información de encuadernación
type: DatatypeProperty
domain: Fondos
comment: Descripción de la encuadernación, cortes y lomo del ejemplar, incluyendo el material, estilo, elementos decorativos, así como supralibros, monogramas o lemas que aparezcan.
comment: Information about binding (inclduing spinal and tail) regading its base material, style, decoration, and monograms and other identificative elements @en
label: Note on binding @en

P7009
type: DatatypeProperty
domain: Fondos
label: Nota de acción

P7010
type: DatatypeProperty
domain: Fondos
label: Nota de reproducción

Library branch
type: DatatypeProperty
domain: Fondos
label: Biblioteca

Antigua signatura (olim)
type: DatatypeProperty
domain: Fondos
label: Antigua signatura
comment: Call numbers/shelf numbers where a resource was previously located, in cases of a relocation [Source: MARC] @en
comment: Signaturas topográficas en las que se ubicaba anteriormente el recurso, en casos de recolocación [fuente: MARC]
label: Former call numbers (olim) @en

Signatura
type: DatatypeProperty
domain: Fondos
label: Signatura
comment: Secuencia numérica o alfabética que indica la localización en depósito del ejemplar
comment: Shelving control number that is used as the shelving scheme for an item. {Source: MARC] @en
label: Call number @en

Localización
type: DatatypeProperty
domain: Fondos
label: Localización
comment: Item specific localization. Same values as P4007 @en
comment: Localización del ejemplar. Mismos valores que P4007
label: Item location @en

P7015
type: DatatypeProperty
domain: Fondos
label: Enumeración primer nivel

P7016
type: DatatypeProperty
domain: Fondos
label: Cronología primer nivel

P7017
type: DatatypeProperty
domain: Fondos
label: Mención textual índices

Mención de fondos
type: DatatypeProperty
domain: Fondos
label: Mención textual fondos
label: En una publicación multivolumen, indica el número total de volúmenes que tiene la biblioteca. En una publicación periódica, indica los años que tiene la biblioteca. Un año encerrado entre paréntesis indica que falta algún número
label: Holdings statement @en
label: In a multivolume publication, information about the total number of volumes held by the library. In a serial, indicated year(s) held by the library. A year closed by parenthesis indicate some issue(s) from that year is/are missing. @en

Mención de suplementos
type: DatatypeProperty
domain: Fondos
label: Mención textual suplementos
comment: Descripción textual de los fondos de los suplementos y material adicional de una publicación periódica en la colección de la biblioteca.
comment: Holdings of serials supplementary material in the collections of the library @en
label: Supplementary Material statement @en

Indexes statement
type: DatatypeProperty
domain: Fondos
label: Índices
comment: Descripción de los fondos de índices de una publicación periódica en la colección de la biblioteca
comment: Description of the holdings of serials indexes in the library collection @en
label: Mención de Índices

P7021
type: DatatypeProperty
domain: Fondos
label: Campo de enlace

P7022
type: DatatypeProperty
domain: Fondos
label: Enumeración segundo nivel

P7023
type: DatatypeProperty
domain: Fondos
label: Enumeración tercer nivel

P7024
type: DatatypeProperty
domain: Fondos
label: Campo de enlace

P7025
type: DatatypeProperty
domain: Fondos
label: Cronología segundo nivel

P7026
type: DatatypeProperty
domain: Fondos
label: Cronología tercer nivel

Nota sobre ejemplar
type: DatatypeProperty
sub property of: P40028
domain: Fondos
comment: Any other information related to the specific item @en
label: Note on item @en
label: Otra información relativa al ejemplar

Fuente de adquisición
type: DatatypeProperty
sub property of: P40050
domain: Fondos
comment: Name of the person(s) or organization that is the source of the material that was acquired by any of the methods registered in P7006 @en
comment: Nombre de la persona o entidad a quien se ha adquirido el material
label: Source of adquisition @en

Fecha de adquisición
type: DatatypeProperty
sub property of: P40050
domain: Fondos
comment: Fecha de adquisición del ejemplar
comment: Item's date of acquisition. @en
label: Date of acquisition @en

tipo de marca de propiedad
type: DatatypeProperty
domain: Marca de propiedad
comment: "Type of provenance mark" values are: Exlibris Anotaciones manuscritas de propiedad (Hand-made property annotations ) Supralibros (Bookplates) Sellos (Stamps) Encuadernaciones (Binding) Marcas de fuego (firemarks) Ex dono Monogramas (Monogram) Signaturas (Owner's librry call numbers) Escudos coloreados (coat-of-arms) @en
comment: Los valores de "tipo de marca" son: Exlibris Anotaciones manuscritas de propiedad Supralibros Sellos Encuadernaciones Marcas de fuego Ex dono Monogramas Signaturas Escudos coloreados
label: type of provenance mark @en

descripción de la marca
type: DatatypeProperty
domain: Marca de propiedad
comment: Includes, when applicable, the transcription of any phrase, motto or emblem present in the mark @en
comment: Incluye, si existe, la transcripción literal de cualquier frase, emblema o divisa
label: mark description @en

descriptores
type: DatatypeProperty
domain: Marca de propiedad
comment: Controlled keywords for describing marks that are heraldical images @en
comment: Palabras claves que describen marcas que son imágenes heráldicas
label: descriptors @en

datación
type: DatatypeProperty
domain: Marca de propiedad
comment: Siglo en el que se utiliza la marca. Expresado en números romanos, con esta fórmula. S. XIX. En caso de abarcar varios siglos, se repite la propiedad con los distintos valores
comment: Timespan where the mark is documented to have been used, expressed in centuries in roman numerals, as this: S. XIX. Timespans encompassing several centuiries repeat this property as many times as necessary for each century. @en
label: mark timespan @en

imagen de la marca
type: DatatypeProperty
domain: Marca de propiedad
comment: Enlace a la marca digitalizada
comment: URL link to the mark's digital image @en
label: mark image @en

BNE id
type: DatatypeProperty
sub property of: P60919
range: Literal
comment: Internal Id number identifying the resource. It is used as a base for HTTP URIs construction @en
comment: Número identificador interno del recurso, usado como base para construir la URI HTTP del recurso

Obra
type: Class
subclass of: C1001
subclass of: C10001
disjoint with: Expresión
disjoint with: Recurso
disjoint with: Ejemplar
disjoint with: Persona
disjoint with: Entidad Corporativa
label: Obra
label: Work @en
comment: A work is an abstract entity; there is no single material object one can point to as the work. We recognize the work through individual realizations or expressions of the work, but the work itself exists only in the commonality of content between and among the various expressions of the work. Because the notion of a work is abstract, it is difficult to define precise boundaries for the entity. The concept of what constitutes a work and where the line of demarcation lies between one work and another may in fact be viewed differently from one culture to another. Consequently the bibliographic conventions established by various cultures or national groups may differ in terms of the criteria they use for determining the boundaries between one work and another. For the purposes of this model variant texts incorporating revisions or updates to an earlier text are viewed simply as expressions of the same work (i.e., the variant texts are not viewed as separate works). Similarly, abridgements or enlargements of an existing text, or the addition of parts or an accompaniment to a musical composition are considered to be different expressions of the same work. Translations from one language to another, musical transcriptions and arrangements, and dubbed or subtitled versions of a film are also considered simply as different expressions of the same original work. By contrast, when the modification of a work involves a significant degree of independent intellectual or artistic effort, the result is viewed, for the purpose of this model, as a new work. Thus paraphrases, rewritings, adaptations for children, parodies, musical variations on a theme and free transcriptions of a musical composition are considered to represent new works. Similarly, adaptations of a work from one literary or art form to another (e.g., dramatizations, adaptations from one medium of the graphic arts to another, etc.) are considered to represent new works. Abstracts, digests and summaries are also conside… @en
comment: Una creación intelectual o artística diferenciada. Una obra es una entidad abstracta; no hay un objeto material único que pueda denominarse la obra. Reconocemos la obra a través de realizaciones individuales o expresiones de la obra; pero la obra en sí solo existe en la comunidad de contenido entre las distintas expresiones de la obra. Cuando hablamos de la Ilíada de Homero como de una obra, nuestro punto de referencia no es un determinado recitado o texto de la obra, sino la creación intelectual que se encuentra tras todas las diferentes expresiones de la obra. Puesto que la noción de obra es abstracta, es difícil definir límites precisos para la entidad. El concepto de lo que constituye una obra y donde está la línea de separación entre una y otra obra puede, de hecho, considerarse de distinta manera en una u otra cultura. Como consecuencia, las convenciones bibliográficas establecidas por distintas culturas o grupos nacionales pueden diferir en los términos de los criterios que utilizan para determinar los límites entre una y otra obra. Para los propósitos de este modelo las variantes de textos que incorporan revisiones o actualizaciones de un texto más antiguo se consideran simplemente como expresiones de la misma obra (es decir, las variantes de textos no se consideran obras independientes). Asimismo, resúmenes o ampliaciones de un texto existente o la adición de partes o un acompañamiento a una composición musical se consideran diferentes expresiones de la misma obra. Las traducciones de una lengua a otra, transcripciones musicales y arreglos y versiones dobladas o subtituladas de una película también se consideran simplemente como diferentes expresiones de una obra original. [fuente: FRBR, traducción al español]

Expresión
type: Class
subclass of: C1002
subclass of: C10006
label: Version @en
label: Versión
comment: An expression is the specific intellectual or artistic form that a work takes each time it is "realized". Expression encompasses, for example, the specific words, sentences, paragraphs, etc. that result from the realization of a work in the form of a text, or the particular sounds, phrasing, etc. resulting from the realization of a musical work. The boundaries of the entity expression are defined, however, so as to exclude aspects of physical form, such as typeface and page layout, that are not integral to the intellectual or artistic realization of the work as such. Inasmuch as the form of expression is an inherent characteristic of the expression, any change in form (e.g., from alpha-numeric notation to spoken word) results in a new expression. Similarly, changes in the intellectual conventions or instruments that are employed to express a work (e.g., translation from one language to another) result in the production of a new expression. [Source: http://iflastandards.info/ns/fr/frbr/frbrer/C1002] @en
comment: La realización intelectual o artística de una obra en forma alfanumérica, musical, notación coreográfica, sonido, imagen, objeto, movimiento, etc., o cualquier combinación de dichas formas. Una expresión es la forma específica intelectual o artística que recibe una obra cada vez que se “realiza”. La expresión incluye, por ejemplo, las palabras concretas, fraseo, párrafos, etc., que son el resultado de la realización de una obra en la forma de un texto, o de notas específicas, estilo, etc., que da como resultado la realización de una obra musical. Sin embargo, se definen los límites de la entidad expresión para excluir aspectos referidos a la forma física tales como la tipografía y los textos de la carátula que no son, en realidad, parte integrante de la realización intelectual o artística de una obra como tal. En la medida en que la forma de expresión es una característica inherente a la expresión, cualquier cambio de esa forma (p. ej., de notación alfanumérica a texto hablado) da como resultado una nueva expresión. Asimismo, los cambios en las convenciones intelectuales o los instrumentos que se emplean para expresar una obra (p. ej., la traducción de una lengua a otra) dan como resultado la producción de una nueva expresión. [fuente: FRBR, traducción al español]
label: Expression @en

Recurso
type: Class
subclass of: C2001
label: Edición
label: Edition @en
comment: An entity, tangible or intangible, that comprises intellectual and/or artistic content and is conceived, produced and/or issued as a unit, forming the basis of a single bibliographic description. Includes text, music, still and moving images, graphics, maps, sound recordings and video recordings, electronic data or programs, including those issued serially.[source: http://iflastandards.info/ns/isbd/elements/C2001] @en
comment: Una entidad, tangible o intangible, que tiene contenido artístico y/o intelectual y que está concebida, producida y/o publicada como una unidad, formando la base de una descripción bibliográfica individual. Incluye texto, música, imágenes fijas y en movimiento, gráficos, mapas, grabaciones sonoras y videograbaciones, programas o datos electrónicos, incluyendo aquellos editados periódicamente. [fuente: ttp://iflastandards.info/ns/isbd/elements/C2001]
label: Resource @en

Ejemplar
type: Class
subclass of: C10003
label: Ejemplar
label: Item @en
comment: An object or objects intended to convey intellectual or artistic content. It is in many instances a single physical object (e.g., a copy of a one-volume monograph, a single audio cassette, etc.). but in other cases, an item may consist of multiple physical pieces or objects. In BNE ontology, class Item only has basic localization data. Other data (history, binding, old call numbers) are stored in Holding class @en
comment: Un ejemplar determinado de un recurso . La entidad definida como ejemplar es una entidad concreta, física y tangible. Se trata, en muchos casos, de un único objeto físico (p. ej., un ejemplar de una monografía en un solo volumen, una cinta de audio, etc.). Sin embargo, hay casos en los que la entidad definida como ítem incluye más de un objeto físico (p. ej., una monografía publicada en dos volúmenes, una grabación publicada en tres discos compactos independientes, etc.) En la ontología BNE, la clase Ejemplar solo contiene información básica de localización. Información más compleja (historia, encuadernación, antiguas signaturas), se relacionan con la entidad Fondos

Persona
type: Class
subclass of: http://iflastandards.info/ns/fr/frad/1004
subclass of: C10004
label: Person @en
label: Persona
comment: La entidad Persona comprende tanto individuos en activo como fallecidos, que existan o se crea que hayan existido. En el modelo las personas se tratan como clases en tanto participen en tareas de creación o realización de obras (por ejemplo, como autores, compositores, dibujantes, editores literarios, traductores, intérpretes...), o sean tema de alguna obra (por ejemplo, en biografías, retratos o fotografías...). Este modelo incluye dentro de la clase Persona a familias en su concepto más amplio, en tanto que puedan ser creadores de recursos y objeto de estudio
comment: The entity defined as person encompasses individuals that are deceased as well as those that are living. For the purposes of this model persons are treated as entities only to the extent that they are involved in the creation or realization of a work (e.g., as authors, composers, artists, editors, translators, directors, performers, etc.), or are the subject of a work (e.g., as the subject of a biographical or autobiographical work, of a history, etc.). [Source: http://iflastandards.info/ns/fr/frbr/frbrer/C1005] The entity Persons in BNE also encompasses families acting as a group, either as creator or as subject of resources @en

Entidad Corporativa
type: Class
subclass of: C10005
label: Corporate body @en
label: Entidad
comment: The entity defined as corporate body encompasses organizations and groups of individuals and-or organizations that are identified by a particular name, including occasional groups and groups that are constituted as meetings, conferences, congresses, expeditions, exhibitions, festivals, fairs, etc. The entity also encompasses organizations that act as territorial authorities, exercising or claiming to exercise government functions over a certain territory, such as a federation, a state, a region, a local municipality, etc. The entity encompasses organizations and groups that are defunct as well as those that continue to operate. For the purposes of this model corporate bodies are treated as entities only to the extent that they are involved in the creation or realization of a work (e.g., as the sponsors or endorsers of a work, etc.), or are the subject of a work (e.g., as the subject of a history, etc.). [Source: http://iflastandards.info/ns/fr/frbr/frbrer/C1006] @en
comment: una organización o grupo de individuos y/u organizaciones que actúan como una unidad. La entidad definida como entidad corporativa abarca organizaciones y grupos de individuos y/u organizaciones que se identifican mediante un nombre particular, incluidos grupos ocasionales y grupos que se constituyen como encuentros, conferencias, congresos, expediciones, exposiciones, festivales, ferias, etc, con tal que tengan un nombre que los identifique. La entidad también incluye organizaciones que actúan como autoridades territoriales, que ejercen o pretenden ejercer funciones gubernamentales sobre un determinado territorio, como una federación, un estado, una región, un municipio, etc. La entidad incluye tanto organizaciones y grupos que ya no existen como los que continúan en funcionamiento. [fuente: FRBR, traducción al español]
label: Corporate Body @en

Fondos
type: Class
subclass of: C10003
comment: An object or objects intended to convey intellectual or artistic content. It is in many instances a single physical object (e.g., a copy of a one-volume monograph, a single audio cassette, etc.). but in other cases, an item may consist of multiple physical pieces or objects. In BNE ontology, class Holding contains more detailed information about the objetc (custody history, binding, adquisition data, former call numbers) Othe basic circulation data, as current localization, are stored in Item class @en
comment: Un ejemplar determinado de un recurso . La entidad definida como ejemplar es una entidad concreta, física y tangible. Se trata, en muchos casos, de un único objeto físico (p. ej., un ejemplar de una monografía en un solo volumen, una cinta de audio, etc.). Sin embargo, hay casos en los que la entidad definida como ítem incluye más de un objeto físico (p. ej., una monografía publicada en dos volúmenes, una grabación publicada en tres discos compactos independientes, etc.) En la ontología BNE, la clase Fondos contiene la información más compleja del ejemplar (historia, encuadernación, antiguas signaturas). La información básica de localización se almacena en la entidad Ejemplar
label: Holding @en

Marca de propiedad
type: Class
subclass of: E37 Mark
comment: Evidences that volumes were owned by a particular person or body. These evidence includes ex-libris, signatures, mottos, bookplates, or specially made bindings @en
comment: Sellos, exlibris, encuadernaciones o cualquier otro tipo de marca que caracteriza a un determinado volumen como procedente de la colección de un poseedor, ya sea personal o institucional
label: Provenance mark @en